Target
High affinity cGMP-specific 3',5'-cyclic phosphodiesterase 9A
Ligand
BDBM50026821
Substrate
Meas. Tech.
ChEMBL_1438248 (CHEMBL3390280)
IC50
>10000±n/a nM
Citation
 Buijnsters, PDe Angelis, MLanglois, XRombouts, FJSanderson, WTresadern, GRitchie, ATrabanco, AAVanHoof, GRoosbroeck, YVAndrés, JI Structure-Based Design of a Potent, Selective, and Brain Penetrating PDE2 Inhibitor with Demonstrated Target Engagement. ACS Med Chem Lett 5:1049-53 (2014)  
Target
Name:
High affinity cGMP-specific 3',5'-cyclic phosphodiesterase 9A
Synonyms:
3',5'-cyclic phosphodiesterase PDE9A_HUMAN Phosphodiesterase 9A (PDE9) | Phosphodiesterase 9A (PDE9A)
Type:
Protein
Mol. Mass.:
68488.40
Organism:
Homo sapiens (Human)
Description:
O76083
Residue:
593
  
Inhibitor
Name:
BDBM50026821
Synonyms:
CHEMBL3331521 US9669035, B-1b
Type:
Small organic molecule
Emp. Form.:
C24H28N6O2
Mol. Mass.:
432.5181
SMILES:
CCCCOc1cncc(c1)-c1nnc2c(C)nc3ccc(CN4CCOCC4)cc3n12
: