Target
cGMP-dependent 3',5'-cyclic phosphodiesterase
Ligand
BDBM50026828
Substrate
Meas. Tech.
ChEMBL_1438238 (CHEMBL3390270)
IC50
6.5±n/a nM
Citation
 Buijnsters, PDe Angelis, MLanglois, XRombouts, FJSanderson, WTresadern, GRitchie, ATrabanco, AAVanHoof, GRoosbroeck, YVAndrés, JI Structure-Based Design of a Potent, Selective, and Brain Penetrating PDE2 Inhibitor with Demonstrated Target Engagement. ACS Med Chem Lett 5:1049-53 (2014)  
Target
Name:
cGMP-dependent 3',5'-cyclic phosphodiesterase
Synonyms:
CGS-PDE Homo sapiens phosphodiesterase 2A (PDE2A) PDE2A cGSPDE
Type:
Enzyme Catalytic Domain
Mol. Mass.:
105691.58
Organism:
Homo sapiens (Human)
Description:
O00408
Residue:
941
  
Inhibitor
Name:
BDBM50026828
Synonyms:
CHEMBL3331515 | US9669035, B-8
Type:
Small organic molecule
Emp. Form.:
C24H26ClN5O2
Mol. Mass.:
451.949
SMILES:
CCCOc1ccc(Cl)c(c1)-c1nnc2c(C)nc3ccc(CN4CCOCC4)cc3n12
: