Target
Melatonin receptor type 1A
Ligand
BDBM9019
Substrate
Meas. Tech.
ChEMBL_1442965 (CHEMBL3378363)
Ki
0.140000±n/a nM
Citation
 Párraga, JMoreno, LDiaz, AEl Aouad, NGalán, ASanz, MJCaignard, DHFigadčre, BCabedo, NCortes, D Efficient synthesis of hexahydroindenopyridines and their potential as melatoninergic ligands. Eur J Med Chem 86:700-9 (2014)  
Target
Name:
Melatonin receptor type 1A
Synonyms:
MTNR1A MTR1A_HUMAN Mel1a melatonin receptor Melatonin receptor Melatonin receptor type 1 (MT1) | Melatonin receptor type 1A
Type:
Enzyme
Mol. Mass.:
39392.94
Organism:
Homo sapiens (Human)
Description:
P48039
Residue:
350
  
Inhibitor
Name:
BDBM9019
Synonyms:
CHEMBL45 N-[2-(5-methoxy-1H-indol-3-yl)ethyl]acetamide
Type:
Small organic molecule
Emp. Form.:
C13H16N2O2
Mol. Mass.:
232.2783
SMILES:
COc1ccc2[nH]cc(CCNC(C)=O)c2c1
: