Target
Interstitial collagenase
Ligand
BDBM50234334
Substrate
Meas. Tech.
ChEMBL_1432368 (CHEMBL3384473)
IC50
>30000±n/a nM
Citation
 Fabre, BRamos, Ade Pascual-Teresa, B Targeting matrix metalloproteinases: exploring the dynamics of the s1' pocket in the design of selective, small molecule inhibitors. J Med Chem 57:10205-19 (2014)  
Target
Name:
Interstitial collagenase
Synonyms:
CLG MMP1 Matrix metalloproteinase-1 | Matrix metalloproteinase-1 (MMP-1)
Type:
Enzyme
Mol. Mass.:
54010.26
Organism:
Homo sapiens (Human)
Description:
P03956
Residue:
469
  
Inhibitor
Name:
BDBM50234334
Synonyms:
BENZYL 6-BENZYL-5,7-DIOXO-6,7-DIHYDRO-5H-[1,3]THIAZOLO[3,2-C]PYRIMIDINE-2-CARBOXYLATE benzyl 6-benzyl-5,7-dioxo-6,7-dihydro-5H-thiazolo[3,2-c]pyrimidine-2-carboxylate | benzyl 6-benzyl-5,7-dioxo-6,7-dihydro-5H-thiazolo[3,2-f]pyrimidine-2-carboxylate
Type:
Small organic molecule
Emp. Form.:
C21H16N2O4S
Mol. Mass.:
392.428
SMILES:
O=C(OCc1ccccc1)c1cn2c(cc(=O)n(Cc3ccccc3)c2=O)s1
: