Target
Interstitial collagenase
Ligand
BDBM27878
Substrate
Meas. Tech.
ChEMBL_1432368 (CHEMBL3384473)
IC50
>2500±n/a nM
Citation
 Fabre, BRamos, Ade Pascual-Teresa, B Targeting matrix metalloproteinases: exploring the dynamics of the s1' pocket in the design of selective, small molecule inhibitors. J Med Chem 57:10205-19 (2014)  
Target
Name:
Interstitial collagenase
Synonyms:
CLG MMP1 Matrix metalloproteinase-1 | Matrix metalloproteinase-1 (MMP-1)
Type:
Enzyme
Mol. Mass.:
54010.26
Organism:
Homo sapiens (Human)
Description:
P03956
Residue:
469
  
Inhibitor
Name:
BDBM27878
Synonyms:
13-(carbamoylmethyl)-3-oxo-N-[(3-oxo-3,4-dihydro-2H-1,4-benzoxazin-6-yl)methyl]-8-thia-4,6-diazatricyclo[7.4.0.0^{2,7}]trideca-1(9),2(7),5-triene-5-carboxamide hexahydrobenzothienopyrimidine, 2
Type:
Small organic molecule
Emp. Form.:
C22H21N5O5S
Mol. Mass.:
467.498
SMILES:
NC(=O)CC1CCCc2sc3nc([nH]c(=O)c3c12)C(=O)NCc1ccc2OCC(=O)Nc2c1
: