Target
Orexin receptor type 2
Ligand
BDBM50417257
Substrate
Meas. Tech.
ChEMBL_1434836 (CHEMBL3384633)
Ki
8.5±n/a nM
Citation
 Yoshida, YTerauchi, TNaoe, YKazuta, YOzaki, FBeuckmann, CTNakagawa, MSuzuki, MKushida, ITakenaka, OUeno, TYonaga, M Design, synthesis, and structure-activity relationships of a series of novel N-aryl-2-phenylcyclopropanecarboxamide that are potent and orally active orexin receptor antagonists. Bioorg Med Chem 22:6071-88 (2014)  
Target
Name:
Orexin receptor type 2
Synonyms:
HCRTR2 OX2R_HUMAN Orexin receptor type 2 (OR-2) Orexin receptor type 2 (OX2R) Ox-2-R | Ox2-R
Type:
Protein
Mol. Mass.:
50710.53
Organism:
Homo sapiens (Human)
Description:
O43614
Residue:
444
  
Inhibitor
Name:
BDBM50417257
Synonyms:
SB-649868
Type:
Small organic molecule
Emp. Form.:
C26H24FN3O3S
Mol. Mass.:
477.55
SMILES:
Cc1nc(C(=O)N2CCCC[C@H]2CNC(=O)c2cccc3occc23)c(s1)-c1ccc(F)cc1
: