Target
Orexin/Hypocretin receptor type 1
Ligand
BDBM50029064
Substrate
Meas. Tech.
ChEMBL_1435499 (CHEMBL3385319)
Ki
123±n/a nM
Citation
 Yoshida, YTerauchi, TNaoe, YKazuta, YOzaki, FBeuckmann, CTNakagawa, MSuzuki, MKushida, ITakenaka, OUeno, TYonaga, M Design, synthesis, and structure-activity relationships of a series of novel N-aryl-2-phenylcyclopropanecarboxamide that are potent and orally active orexin receptor antagonists. Bioorg Med Chem 22:6071-88 (2014)  
Target
Name:
Orexin/Hypocretin receptor type 1
Synonyms:
HCRTR1 OX1R_HUMAN Orexin receptor type 1 (OR 1) Orexin receptor type 1 (OX1) Orexin receptor type 1 (OxR1) | Ox1r
Type:
Protein
Mol. Mass.:
47554.50
Organism:
Homo sapiens (Human)
Description:
O43613
Residue:
425
  
Inhibitor
Name:
BDBM50029064
Synonyms:
CHEMBL3343259
Type:
Small organic molecule
Emp. Form.:
C25H23N3O4
Mol. Mass.:
429.4678
SMILES:
COc1ccc(OC[C@]2(C[C@H]2C(=O)Nc2ccc(cn2)C#N)c2ccccc2)cc1OC
: