Target
Free fatty acid receptor 1
Ligand
BDBM22496
Substrate
Meas. Tech.
ChEMBL_1433672 (CHEMBL3385788)
EC50
316±n/a nM
Citation
 Helal, MADarwish, KMHammad, MA Homology modeling and explicit membrane molecular dynamics simulation to delineate the mode of binding of thiazolidinediones into FFAR1 and the mechanism of receptor activation. Bioorg Med Chem Lett 24:5330-6 (2014)  
Target
Name:
Free fatty acid receptor 1
Synonyms:
FFAR1 G-protein Coupled Receptor 40 | GPR40
Type:
G Protein-Coupled Receptor (GPCR)
Mol. Mass.:
31473.32
Organism:
Homo sapiens (Human)
Description:
O14842
Residue:
300
  
Inhibitor
Name:
BDBM22496
Synonyms:
3-(4-{[(3-phenoxyphenyl)methyl]amino}phenyl)propanoic acid carboxylic acid agonist, 2
Type:
Small organic molecule
Emp. Form.:
C22H21NO3
Mol. Mass.:
347.407
SMILES:
OC(=O)CCc1ccc(NCc2cccc(Oc3ccccc3)c2)cc1
: