Target
Beta-secretase 1
Ligand
BDBM50036575
Substrate
Meas. Tech.
ChEMBL_1433718 (CHEMBL3386389)
Ki
480±n/a nM
Citation
 Caldwell, JPMazzola, RDDurkin, JChen, JChen, XFavreau, LKennedy, MKuvelkar, RLee, JMcHugh, NMcKittrick, BOrth, PStamford, AStrickland, CVoigt, JWang, LZhang, LZhang, QZhu, Z Discovery of potent iminoheterocycle BACE1 inhibitors. Bioorg Med Chem Lett 24:5455-9 (2015)  
Target
Name:
Beta-secretase 1
Synonyms:
ASP2 Aspartyl protease 2 BACE1 Beta-secretase (BACE) Beta-secretase 1 (BACE 1) Beta-secretase 1 (BACE1) Beta-site amyloid precursor protein cleaving enzyme 1 Memapsin-2 beta-Secretase (BACE-1) | beta-Secretase (BACE1)
Type:
Protein
Mol. Mass.:
55755.10
Organism:
Homo sapiens (Human)
Description:
P56817
Residue:
501
  
Inhibitor
Name:
BDBM50036575
Synonyms:
CHEMBL3354249
Type:
Small organic molecule
Emp. Form.:
C23H40N4O
Mol. Mass.:
388.5899
SMILES:
CN1C(=N)N[C@](CCC2CCCCC2)(C[C@H]2CCC[C@H](C2)NCC2CC2)C1=O
: