Target
Beta-secretase 1
Ligand
BDBM50036587
Substrate
Meas. Tech.
ChEMBL_1433718 (CHEMBL3386389)
Ki
27±n/a nM
Citation
 Caldwell, JPMazzola, RDDurkin, JChen, JChen, XFavreau, LKennedy, MKuvelkar, RLee, JMcHugh, NMcKittrick, BOrth, PStamford, AStrickland, CVoigt, JWang, LZhang, LZhang, QZhu, Z Discovery of potent iminoheterocycle BACE1 inhibitors. Bioorg Med Chem Lett 24:5455-9 (2015)  
Target
Name:
Beta-secretase 1
Synonyms:
ASP2 Aspartyl protease 2 BACE1 Beta-secretase (BACE) Beta-secretase 1 (BACE 1) Beta-secretase 1 (BACE1) Beta-site amyloid precursor protein cleaving enzyme 1 Memapsin-2 beta-Secretase (BACE-1) | beta-Secretase (BACE1)
Type:
Protein
Mol. Mass.:
55755.10
Organism:
Homo sapiens (Human)
Description:
P56817
Residue:
501
  
Inhibitor
Name:
BDBM50036587
Synonyms:
CHEMBL1231280
Type:
Small organic molecule
Emp. Form.:
C32H49N5O2
Mol. Mass.:
535.7638
SMILES:
CCC[C@H]1CN(Cc2ccc(CN3C(=N)N[C@](CCC4CCCCC4)(CC4CCCCC4)C3=O)cc2)C(=O)N1
: