Target
Cathepsin D
Ligand
BDBM50036581
Substrate
Meas. Tech.
ChEMBL_1433719 (CHEMBL3386390)
Ki
6000±n/a nM
Citation
 Caldwell, JPMazzola, RDDurkin, JChen, JChen, XFavreau, LKennedy, MKuvelkar, RLee, JMcHugh, NMcKittrick, BOrth, PStamford, AStrickland, CVoigt, JWang, LZhang, LZhang, QZhu, Z Discovery of potent iminoheterocycle BACE1 inhibitors. Bioorg Med Chem Lett 24:5455-9 (2015)  
Target
Name:
Cathepsin D
Synonyms:
CATD_HUMAN CTSD Cathepsin D heavy chain Cathepsin D precursor
Type:
Enzyme
Mol. Mass.:
44551.72
Organism:
Homo sapiens (Human)
Description:
Human proCathepsin D (SwissProt accession number P07339) was expressed in Sf9 cells, purified, and autoactivated.
Residue:
412
  
Inhibitor
Name:
BDBM50036581
Synonyms:
CHEMBL3354247
Type:
Small organic molecule
Emp. Form.:
C24H40N4O2
Mol. Mass.:
416.6
SMILES:
[H][C@]1(C[C@@]2(CCC3CCCCC3)NC(=N)N(C)C2=O)CCN(C1)C(=O)CC1CCCC1
: