Target
Tyrosine-protein kinase ITK/TSK
Ligand
BDBM50037069
Substrate
Meas. Tech.
ChEMBL_1435180 (CHEMBL3389531)
Ki
5.3±n/a nM
Citation
 Trani, GBarker, JJBromidge, SMBrookfield, FABurch, JDChen, YEigenbrot, CHeifetz, AIsmaili, MHJohnson, AKrülle, TMMacKinnon, CHMaghames, RMcEwan, PAMontalbetti, CAOrtwine, DFPérez-Fuertes, YVaidya, DGWang, XZarrin, AAPei, Z Design, synthesis and structure-activity relationships of a novel class of sulfonylpyridine inhibitors of Interleukin-2 inducible T-cell kinase (ITK). Bioorg Med Chem Lett 24:5818-23 (2014)  
Target
Name:
Tyrosine-protein kinase ITK/TSK
Synonyms:
EMT ITK_HUMAN LYK Tyrosine-protein kinase ITK Tyrosine-protein kinase Lyk
Type:
Protein
Mol. Mass.:
71839.20
Organism:
Homo sapiens (Human)
Description:
Q08881
Residue:
620
  
Inhibitor
Name:
BDBM50037069
Synonyms:
CHEMBL3355731
Type:
Small organic molecule
Emp. Form.:
C27H29N5O4S
Mol. Mass.:
519.615
SMILES:
COc1cccc(c1)-c1cc(Nc2cc(cc(N[C@H]3CC[C@H](O)CC3)n2)S(=O)(=O)c2ccccc2)n[nH]1
: