Target
Tyrosine-protein kinase ITK/TSK
Ligand
BDBM50037071
Substrate
Meas. Tech.
ChEMBL_1435180 (CHEMBL3389531)
Ki
1.8±n/a nM
Citation
 Trani, GBarker, JJBromidge, SMBrookfield, FABurch, JDChen, YEigenbrot, CHeifetz, AIsmaili, MHJohnson, AKrülle, TMMacKinnon, CHMaghames, RMcEwan, PAMontalbetti, CAOrtwine, DFPérez-Fuertes, YVaidya, DGWang, XZarrin, AAPei, Z Design, synthesis and structure-activity relationships of a novel class of sulfonylpyridine inhibitors of Interleukin-2 inducible T-cell kinase (ITK). Bioorg Med Chem Lett 24:5818-23 (2014)  
Target
Name:
Tyrosine-protein kinase ITK/TSK
Synonyms:
EMT ITK_HUMAN LYK Tyrosine-protein kinase ITK Tyrosine-protein kinase Lyk
Type:
Protein
Mol. Mass.:
71839.20
Organism:
Homo sapiens (Human)
Description:
Q08881
Residue:
620
  
Inhibitor
Name:
BDBM50037071
Synonyms:
CHEMBL3355733
Type:
Small organic molecule
Emp. Form.:
C26H26FN5O3S
Mol. Mass.:
507.58
SMILES:
O[C@H]1CC[C@@H](CC1)Nc1cc(cc(Nc2cc([nH]n2)-c2ccc(F)cc2)n1)S(=O)(=O)c1ccccc1
: