Target
Cytochrome P450 2A6
Ligand
BDBM50037774
Substrate
Meas. Tech.
ChEMBL_1438834 (CHEMBL3390302)
Ki
90±n/a nM
Citation
 Tani, NJuvonen, RORaunio, HFashe, MLeppänen, JZhao, BTyndale, RFRahnasto-Rilla, M Rational design of novel CYP2A6 inhibitors. Bioorg Med Chem 22:6655-64 (2015)  
Target
Name:
Cytochrome P450 2A6
Synonyms:
1,4-cineole 2-exo-monooxygenase CP2A6_HUMAN CYP2A6 Coumarin 7-hydroxylase Cytochrome P450 IIA3 | Cytochrome P450(I)
Type:
Protein
Mol. Mass.:
56514.34
Organism:
Homo sapiens (Human)
Description:
P11509
Residue:
494
  
Inhibitor
Name:
BDBM50037774
Synonyms:
CHEMBL3358194
Type:
Small organic molecule
Emp. Form.:
C9H8ClNS
Mol. Mass.:
197.685
SMILES:
NCc1csc2ccc(Cl)cc12
: