Target
Adenosine receptor A3
Ligand
BDBM50041283
Substrate
Meas. Tech.
ChEMBL_1445856 (CHEMBL3376724)
Ki
23±n/a nM
Citation
 Catarzi, DVarano, FPoli, DSquarcialupi, LBetti, MTrincavelli, LMartini, CDal Ben, DThomas, AVolpini, RColotta, V 1,2,4-triazolo[1,5-a]quinoxaline derivatives and their simplified analogues as adenosine A3 receptor antagonists. Synthesis, structure-affinity relationships and molecular modeling studies. Bioorg Med Chem 23:9-21 (2014)  
Target
Name:
Adenosine receptor A3
Synonyms:
A3 adenosine receptor (hA3) ADORA3 | Adenosine A3 receptor (A3AR)
Type:
G Protein-Coupled Receptor (GPCR)
Mol. Mass.:
36197.32
Organism:
Homo sapiens (Human)
Description:
P0DMS8
Residue:
318
  
Inhibitor
Name:
BDBM50041283
Synonyms:
CHEMBL3355977
Type:
Small organic molecule
Emp. Form.:
C21H18N4O3
Mol. Mass.:
374.3926
SMILES:
COc1ccc(cc1)-c1nc2CN(C(=O)OCC#C)c3ccc(C)cc3-n2n1
: