Target
Dual specificity protein kinase TTK
Ligand
BDBM50042931
Substrate
Meas. Tech.
ChEMBL_1444682 (CHEMBL3377244)
IC50
0.600000±n/a nM
Citation
 Rosse, G Combination of novel imidazopyridazine mps-1 kinase inhibitors and bcl-2 family protein inhibitors. ACS Med Chem Lett 6:7-8 (2015)  
Target
Name:
Dual specificity protein kinase TTK
Synonyms:
Dual specificity protein kinase (TTK) MPS1 Monopolar Spindle 1 (MPS1) Monopolar Spindle 1 Kinase (MPS1) TTK | TTK_HUMAN
Type:
Protein
Mol. Mass.:
97086.79
Organism:
Homo sapiens (Human)
Description:
P33981
Residue:
857
  
Inhibitor
Name:
BDBM50042931
Synonyms:
CHEMBL3354995 | US9512126, 16
Type:
Small organic molecule
Emp. Form.:
C28H26F5N5O2
Mol. Mass.:
559.5304
SMILES:
COc1ccc(cc1)C(F)(F)c1cc(NCCC(F)(F)F)c2ncc(-c3ccc(C(=O)NC4CC4)c(C)c3)n2n1
: