Target
Transcription factor Jun
Ligand
BDBM50092874
Substrate
Meas. Tech.
ChEMBL_1457997 (CHEMBL3367171)
IC50
>10000±n/a nM
Citation
 Ye, NDing, YWild, CShen, QZhou, J Small molecule inhibitors targeting activator protein 1 (AP-1). J Med Chem 57:6930-48 (2014)  
Target
Name:
Transcription factor Jun
Synonyms:
AP1 JUN Proto-oncogene c-JUN Transcription factor AP1 p39
Type:
Mol. Mass.:
35683.24
Organism:
Homo sapiens (Human)
Description:
P05412
Residue:
331
  
Inhibitor
Name:
BDBM50092874
Synonyms:
2,4-Bis-trifluoromethyl-pyrimidine-5-carboxylic acid (3,5-bis-trifluoromethyl-phenyl)-amide | CHEMBL128314
Type:
Small organic molecule
Emp. Form.:
C15H5F12N3O
Mol. Mass.:
471.2005
SMILES:
FC(F)(F)c1cc(NC(=O)c2cnc(nc2C(F)(F)F)C(F)(F)F)cc(c1)C(F)(F)F
: