Target
Sodium-dependent noradrenaline transporter
Ligand
BDBM50044849
Substrate
Meas. Tech.
ChEMBL_1455322 (CHEMBL3362686)
IC50
<100000±n/a nM
Citation
 Sparks, SMChen, GCollins, JLDanger, DDock, STJayawickreme, CJenkinson, SLaudeman, CLeesnitzer, MALiang, XMaloney, PMcCoy, DCMoncol, DRash, VRimele, TVulimiri, PWay, JMRoss, S Identification of diarylsulfonamides as agonists of the free fatty acid receptor 4 (FFA4/GPR120). Bioorg Med Chem Lett 24:3100-3 (2014)  
Target
Name:
Sodium-dependent noradrenaline transporter
Synonyms:
Monoamine transporter NET Noradrenaline Transporter (NET) Norepinephrine transporter protein (NET) SLC6A2 Sodium-dependent noradrenaline transporter (NET) | Solute carrier family 6 member 2
Type:
Multi-pass membrane protein
Mol. Mass.:
69337.72
Organism:
Homo sapiens (Human)
Description:
P23975
Residue:
617
  
Inhibitor
Name:
BDBM50044849
Synonyms:
CHEMBL3311308
Type:
Small organic molecule
Emp. Form.:
C16H19NO3S
Mol. Mass.:
305.392
SMILES:
COc1ccc(cc1)S(=O)(=O)Nc1c(C)cc(C)cc1C
: