Target
Peptidyl-prolyl cis-trans isomerase FKBP1B
Ligand
BDBM50030448
Substrate
Meas. Tech.
ChEMBL_1458980 (CHEMBL3369573)
Kd
0.400000±n/a nM
Citation
 Gibbs, AC Elements and modulation of functional dynamics. J Med Chem 57:7819-37 (2014)  
Target
Name:
Peptidyl-prolyl cis-trans isomerase FKBP1B
Synonyms:
12.6 kDa FKBP FKB1B_HUMAN FKBP-1B FKBP1B FKBP9 OTK4 Peptidyl-prolyl cis-trans isomerase FKBP1B h-FKBP-12 | mTOR/FKBP12A/FKBP12B
Type:
PROTEIN
Mol. Mass.:
11785.40
Organism:
Homo sapiens (Human)
Description:
ChEMBL_1458980
Residue:
108
  
Inhibitor
Name:
BDBM50030448
Synonyms:
8-DEETHYL-8-[BUT-3-ENYL]-ASCOMYCIN TACROLIMUS
Type:
Small organic molecule
Emp. Form.:
C44H69NO12
Mol. Mass.:
804.0182
SMILES:
CO[C@@H]1C[C@@H](CC[C@H]1O)\C=C(/C)[C@H]1OC(=O)[C@@H]2CCCCN2C(=O)C(=O)[C@]2(O)O[C@@H]([C@H](C[C@H]2C)OC)[C@H](C[C@@H](C)C\C(C)=C\[C@@H](CC=C)C(=O)C[C@H](O)[C@H]1C)OC
: