Target
Streptavidin
Ligand
BDBM50045333
Substrate
Meas. Tech.
ChEMBL_1458982 (CHEMBL3369575)
Kd
11±n/a nM
Citation
 Gibbs, AC Elements and modulation of functional dynamics. J Med Chem 57:7819-37 (2014)  
Target
Name:
Streptavidin
Synonyms:
SAV_STRAV
Type:
Protein
Mol. Mass.:
18835.54
Organism:
Streptomyces avidinii
Description:
P22629
Residue:
183
  
Inhibitor
Name:
BDBM50045333
Synonyms:
CHEBI:90705 | SB-203580
Type:
Small organic molecule
Emp. Form.:
C21H16FN3OS
Mol. Mass.:
377.435
SMILES:
C[S+]([O-])c1ccc(cc1)-c1nc(c([nH]1)-c1ccncc1)-c1ccc(F)cc1
: