Target
Cathepsin B
Ligand
BDBM91562
Substrate
Meas. Tech.
ChEMBL_1459865 (CHEMBL3367288)
Ki
1311±n/a nM
Citation
 Raghav, NSingh, M SAR studies of differently functionalized chalcones based hydrazones and their cyclized derivatives as inhibitors of mammalian cathepsin B and cathepsin H. Bioorg Med Chem 22:4233-45 (2014)  
Target
Name:
Cathepsin B
Synonyms:
Type:
Protein
Mol. Mass.:
36777.57
Organism:
Capra hircus (Goat)
Description:
Residue:
335
  
Inhibitor
Name:
BDBM91562
Synonyms:
3-(4-methoxyphenyl)-2,5-diphenyl-3,4-dihydropyrazole VU0467048-1 | cid_349865
Type:
Small organic molecule
Emp. Form.:
C22H20N2O
Mol. Mass.:
328.407
SMILES:
COc1ccc(cc1)C1CC(=NN1c1ccccc1)c1ccccc1
: