Target
Calcitonin gene-related peptide type 1 receptor
Ligand
BDBM50184069
Substrate
Meas. Tech.
ChEMBL_1457285 (CHEMBL3370550)
Ki
0.014000±n/a nM
Citation
 Bell, IM Calcitonin gene-related peptide receptor antagonists: new therapeutic agents for migraine. J Med Chem 57:7838-58 (2014)  
Target
Name:
Calcitonin gene-related peptide type 1 receptor
Synonyms:
Adrenomedullin receptor AM1; CALCRL/RAMP2 CALRL_HUMAN CGRP type 1 receptor mRNA Calcitonin gene-related peptide (CGRP) receptor Calcitonin receptor-like receptor Human CL receptor
Type:
Enzyme Catalytic Domain
Mol. Mass.:
52980.45
Organism:
Homo sapiens (Human)
Description:
Q16602
Residue:
461
  
Inhibitor
Name:
BDBM50184069
Synonyms:
CHEMBL207197 N-{(1S)-5-amino-1-[(4-pyridin-4-ylpiperazin-1-yl)carbonyl]pentyl}-3,5-dibromo-Nalpha-{[4-(2-oxo-1,4-dihydroquinazolin-3(2H)-yl)piperidin-1-yl]carbonyl}-D-tyrosinamide | OLCEGEPANT
Type:
Small organic molecule
Emp. Form.:
C38H47Br2N9O5
Mol. Mass.:
869.645
SMILES:
NCCCC[C@H](NC(=O)[C@@H](Cc1cc(Br)c(O)c(Br)c1)NC(=O)N1CCC(CC1)N1Cc2ccccc2NC1=O)C(=O)N1CCN(CC1)c1ccncc1
: