Target
Adenosine receptor A2b
Ligand
BDBM50109461
Substrate
Meas. Tech.
ChEMBL_1452898 (CHEMBL3366214)
Ki
222±n/a nM
Citation
 Federico, SCiancetta, APorta, NRedenti, SPastorin, GCacciari, BKlotz, KNMoro, SSpalluto, G Scaffold decoration at positions 5 and 8 of 1,2,4-triazolo[1,5-c]pyrimidines to explore the antagonist profiling on adenosine receptors: a preliminary structure-activity relationship study. J Med Chem 57:6210-25 (2014)  
Target
Name:
Adenosine receptor A2b
Synonyms:
AA2BR_HUMAN ADORA2B Adenosine receptors A2b | Adenosine receptors; A2a & A2b
Type:
G Protein-Coupled Receptor (GPCR)
Mol. Mass.:
36341.22
Organism:
Homo sapiens (Human)
Description:
Residue:
332
  
Inhibitor
Name:
BDBM50109461
Synonyms:
1-(2-(furan-2-yl)-8-methyl-8H-pyrazolo[4,3-e][1,2,4]triazolo[1,5-c]pyrimidin-5-yl)-3-phenylurea CHEMBL324735 | MRE 3046F20
Type:
Small organic molecule
Emp. Form.:
C18H14N8O2
Mol. Mass.:
374.3562
SMILES:
Cn1cc2c(n1)nc(NC(=O)Nc1ccccc1)n1nc(nc21)-c1ccco1
: