Target
N-lysine methyltransferase KMT5A
Ligand
BDBM50051116
Substrate
Meas. Tech.
ChEMBL_1450358 (CHEMBL3378195)
IC50
6500±n/a nM
Citation
 Ma, AYu, WLi, FBleich, RMHerold, JMButler, KVNorris, JLKorboukh, VTripathy, AJanzen, WPArrowsmith, CHFrye, SVVedadi, MBrown, PJJin, J Discovery of a selective, substrate-competitive inhibitor of the lysine methyltransferase SETD8. J Med Chem 57:6822-33 (2014)  
Target
Name:
N-lysine methyltransferase KMT5A
Synonyms:
KMT5A N-lysine methyltransferase SETD8 SET domain-containing protein 8 (SetD8) SET8 | SETD8
Type:
Enzyme
Mol. Mass.:
42919.11
Organism:
Homo sapiens (Human)
Description:
Q9NQR1
Residue:
393
  
Inhibitor
Name:
BDBM50051116
Synonyms:
CHEMBL3318284
Type:
Small organic molecule
Emp. Form.:
C30H50O7
Mol. Mass.:
522.7138
SMILES:
[H][C@]12[C@@H](C)[C@H](O)C[C@@H](O)[C@@]1(C)C=C(C)[C@H]([C@@H]2\C=C(/C)C(O)=O)C(C)=CC[C@H](O)C[C@@H](O)[C@H](C)[C@@H](O)C(C)C
: