Target
N-lysine methyltransferase KMT5A
Ligand
BDBM50051117
Substrate
Meas. Tech.
ChEMBL_1450364 (CHEMBL3378201)
IC50
37700±n/a nM
Citation
 Ma, AYu, WLi, FBleich, RMHerold, JMButler, KVNorris, JLKorboukh, VTripathy, AJanzen, WPArrowsmith, CHFrye, SVVedadi, MBrown, PJJin, J Discovery of a selective, substrate-competitive inhibitor of the lysine methyltransferase SETD8. J Med Chem 57:6822-33 (2014)  
Target
Name:
N-lysine methyltransferase KMT5A
Synonyms:
KMT5A N-lysine methyltransferase SETD8 SET domain-containing protein 8 (SetD8) SET8 | SETD8
Type:
Enzyme
Mol. Mass.:
42919.11
Organism:
Homo sapiens (Human)
Description:
Q9NQR1
Residue:
393
  
Inhibitor
Name:
BDBM50051117
Synonyms:
CHEMBL3318285
Type:
Small organic molecule
Emp. Form.:
C23H35N5O2
Mol. Mass.:
413.5563
SMILES:
COc1cc2nc(nc(NCCCCCN3CCCC3)c2cc1OC)N1CCCC1
: