Target
Tyrosine-protein phosphatase non-receptor type 11
Ligand
BDBM50054270
Substrate
Meas. Tech.
ChEMBL_1458320 (CHEMBL3369282)
IC50
8600±n/a nM
Citation
 Zeng, LFZhang, RYYu, ZHLi, SWu, LGunawan, AMLane, BSMali, RSLi, XChan, RJKapur, RWells, CDZhang, ZY Therapeutic potential of targeting the oncogenic SHP2 phosphatase. J Med Chem 57:6594-609 (2014)  
Target
Name:
Tyrosine-protein phosphatase non-receptor type 11
Synonyms:
PTN11_HUMAN PTP-2C PTPN11 Protein tyrosine phosphatase (PTP) Shp2 Protein-tyrosine phosphatase 2C SHP2 Src homology phosphatase 2 (SHP-2) Tyrosine-protein phosphatase non-receptor type 11 (PTPN11) Tyrosine-protein phosphatase non-receptor type 11 (SHP2)
Type:
Protein phosphatase
Mol. Mass.:
68443.59
Organism:
Homo sapiens (Human)
Description:
Q06124
Residue:
597
  
Inhibitor
Name:
BDBM50054270
Synonyms:
CHEMBL3319389 | US9522881, 11c-7 (L88M33)
Type:
Small organic molecule
Emp. Form.:
C27H21F3IN3O6
Mol. Mass.:
667.3718
SMILES:
Cn1c(c(I)c2cc(C(O)=O)c(O)cc12)-c1cccc(NC(=O)CCC(=O)Nc2ccc(OC(F)(F)F)cc2)c1
: