Target
Tyrosine-protein kinase receptor TYRO3
Ligand
BDBM50055499
Substrate
Meas. Tech.
ChEMBL_1451338 (CHEMBL3363357)
IC50
60±n/a nM
Citation
 Zhang, WDeRyckere, DHunter, DLiu, JStashko, MAMinson, KACummings, CTLee, MGlaros, TGNewton, DLSather, SZhang, DKireev, DJanzen, WPEarp, HSGraham, DKFrye, SVWang, X UNC2025, a potent and orally bioavailable MER/FLT3 dual inhibitor. J Med Chem 57:7031-41 (2014)  
Target
Name:
Tyrosine-protein kinase receptor TYRO3
Synonyms:
BYK RSE TIF TYRO3_HUMAN | Tyrosine-protein kinase SKY
Type:
Protein
Mol. Mass.:
96894.13
Organism:
Homo sapiens (Human)
Description:
Q06418
Residue:
890
  
Inhibitor
Name:
BDBM50055499
Synonyms:
CHEMBL3326002
Type:
Small organic molecule
Emp. Form.:
C25H34N6O4S
Mol. Mass.:
514.64
SMILES:
CCCCNc1ncc2c(nn([C@H]3CC[C@H](O)CC3)c2n1)-c1ccc(cc1)S(=O)(=O)N1CCOCC1
: