Target
NT-3 growth factor receptor
Ligand
BDBM50055496
Substrate
Meas. Tech.
ChEMBL_1451340 (CHEMBL3363359)
IC50
4.4±n/a nM
Citation
 Zhang, WDeRyckere, DHunter, DLiu, JStashko, MAMinson, KACummings, CTLee, MGlaros, TGNewton, DLSather, SZhang, DKireev, DJanzen, WPEarp, HSGraham, DKFrye, SVWang, X UNC2025, a potent and orally bioavailable MER/FLT3 dual inhibitor. J Med Chem 57:7031-41 (2014)  
Target
Name:
NT-3 growth factor receptor
Synonyms:
GP145-TrkC NTRK3_HUMAN Neurotrophic tyrosine kinase receptor type 3 Trk-C Tyrosine kinase receptor C (Trk-C)
Type:
Enzyme
Mol. Mass.:
94428.15
Organism:
Homo sapiens (Human)
Description:
Q16288
Residue:
839
  
Inhibitor
Name:
BDBM50055496
Synonyms:
CHEMBL3326006
Type:
Small organic molecule
Emp. Form.:
C28H40N6O
Mol. Mass.:
476.6568
SMILES:
CCCCNc1ncc2c(cn([C@H]3CC[C@H](O)CC3)c2n1)-c1ccc(CN2CCN(C)CC2)cc1
: