Target
Glycogen phosphorylase, muscle form
Ligand
BDBM50056288
Substrate
Meas. Tech.
ChEMBL_1449753 (CHEMBL3378176)
Ki
5140±n/a nM
Citation
 Parmenopoulou, VKantsadi, ALTsirkone, VGChatzileontiadou, DSManta, SZographos, SEMolfeta, CArchontis, GAgius, LHayes, JMLeonidas, DDKomiotis, D Structure based inhibitor design targeting glycogen phosphorylase B. Virtual screening, synthesis, biochemical and biological assessment of novel N-acyl-ß-d-glucopyranosylamines. Bioorg Med Chem 22:4810-25 (2014)  
Target
Name:
Glycogen phosphorylase, muscle form
Synonyms:
Glycogen Phosphorylase (PYGM) Glycogen phosphorylase, muscle form PYGM | PYGM_RABIT
Type:
Enzyme
Mol. Mass.:
97296.32
Organism:
Oryctolagus cuniculus (rabbit)
Description:
Phosphorylation of Ser-15 converts phosphorylase B (unphosphorylated) to phosphorylase A.
Residue:
843
  
Inhibitor
Name:
BDBM50056288
Synonyms:
CHEMBL3322335
Type:
Small organic molecule
Emp. Form.:
C21H23NO6
Mol. Mass.:
385.4104
SMILES:
OC[C@H]1O[C@@H](NC(=O)\C=C\c2ccc(cc2)-c2ccccc2)[C@H](O)[C@@H](O)[C@@H]1O
: