Target
Carbonic anhydrase 9
Ligand
BDBM50058939
Substrate
Meas. Tech.
ChEMBL_1456926 (CHEMBL3368143)
Ki
14±n/a nM
Citation
 Pala, NMicheletto, LSechi, MAggarwal, MCarta, FMcKenna, RSupuran, CT Carbonic Anhydrase Inhibition with Benzenesulfonamides and Tetrafluorobenzenesulfonamides Obtained via Click Chemistry. ACS Med Chem Lett 5:927-30 (2014)  
Target
Name:
Carbonic anhydrase 9
Synonyms:
CA-IX CAH9_HUMAN Carbonic anhydrase 9 (CA IX) Carbonic anhydrase 9 precursor Carbonic anhydrase IX (CAIX) Carbonic anhydrases; II & IX MN RCC-associated antigen G250
Type:
Enzyme
Mol. Mass.:
49669.03
Organism:
Homo sapiens (Human)
Description:
Catalytic domain of human cloned isozyme was used in the assay
Residue:
459
  
Inhibitor
Name:
BDBM50058939
Synonyms:
CHEMBL3326418
Type:
Small organic molecule
Emp. Form.:
C14H15F4N5O4S
Mol. Mass.:
425.359
SMILES:
CC(C)(C)OC(=O)NCc1cn(nn1)-c1c(F)c(F)c(c(F)c1F)S(N)(=O)=O
: