Target
D(2) dopamine receptor
Ligand
BDBM50059807
Substrate
Meas. Tech.
ChEMBL_1461354 (CHEMBL3396204)
EC50
<100000±n/a nM
Citation
 Jörg, MMay, LTMak, FSLee, KCMiller, NDScammells, PJCapuano, B Synthesis and pharmacological evaluation of dual acting ligands targeting the adenosine A2A and dopamine D2 receptors for the potential treatment of Parkinson's disease. J Med Chem 58:718-38 (2015)  
Target
Name:
D(2) dopamine receptor
Synonyms:
D(2) dopamine receptor DOPAMINE D2 Long DRD2 Dopamine D2 receptor Dopamine D2 receptor (D2R) Dopamine2-like | d2
Type:
Cell-surface receptors
Mol. Mass.:
50647.10
Organism:
Homo sapiens (Human)
Description:
P14416
Residue:
443
  
Inhibitor
Name:
BDBM50059807
Synonyms:
CHEMBL3394270
Type:
Small organic molecule
Emp. Form.:
C15H21N3O
Mol. Mass.:
259.3467
SMILES:
NC1CCN(CCc2cccc3NC(=O)Cc23)CC1
: