Target
Sphingosine 1-phosphate receptor 1
Ligand
BDBM50063864
Substrate
Meas. Tech.
ChEMBL_1463793 (CHEMBL3404803)
EC50
0.040000±n/a nM
Citation
 Buzard, DJSchrader, TOZhu, XLehmann, JJohnson, BKasem, MKim, SHKawasaki, ALopez, LMoody, JHan, SGao, YEdwards, JBarden, JThatte, JGatlin, JJones, RM Design and synthesis of new tricyclic indoles as potent modulators of the S1P1 receptor. Bioorg Med Chem Lett 25:659-63 (2015)  
Target
Name:
Sphingosine 1-phosphate receptor 1
Synonyms:
CD_antigen=CD363 Endothelial differentiation G-protein coupled receptor 1 S1P receptor Edg-1 S1PR1_RAT Sphingosine 1-phosphate receptor Edg-1
Type:
PROTEIN
Mol. Mass.:
42770.88
Organism:
Rattus norvegicus
Description:
ChEMBL_1463793
Residue:
383
  
Inhibitor
Name:
BDBM50063864
Synonyms:
CHEMBL3403619 | US10676467, Compound TZ 50 13
Type:
Small organic molecule
Emp. Form.:
C26H27F3N2O3
Mol. Mass.:
472.4994
SMILES:
OC(=O)CC1NCCc2c1[nH]c1ccc(OCc3ccc(C4CCCC4)c(c3)C(F)(F)F)cc21
: