Target
G-protein coupled bile acid receptor 1
Ligand
BDBM21674
Substrate
Meas. Tech.
ChEMBL_1465940 (CHEMBL3406768)
EC50
6100±n/a nM
Citation
 Yu, DDSousa, KMMattern, DLWagner, JFu, XVaidehi, NForman, BMHuang, W Stereoselective synthesis, biological evaluation, and modeling of novel bile acid-derived G-protein coupled bile acid receptor 1 (GP-BAR1, TGR5) agonists. Bioorg Med Chem 23:1613-28 (2015)  
Target
Name:
G-protein coupled bile acid receptor 1
Synonyms:
BG37 GPBAR_HUMAN TGR5 hGPCR19
Type:
G Protein-Coupled Receptor (GPCR)
Mol. Mass.:
35260.02
Organism:
Homo sapiens (Human)
Description:
CHO cells transiently transfected with hTGR5.
Residue:
330
  
Inhibitor
Name:
BDBM21674
Synonyms:
(4R)-4-[(1S,2S,5R,7S,9R,10R,11S,14R,15R)-5,9-dihydroxy-2,15-dimethyltetracyclo[8.7.0.0^{2,7}.0^{11,15}]heptadecan-14-yl]pentanoic acid CHENODIOL US10208081, CDCA
Type:
Steroid
Emp. Form.:
C24H40O4
Mol. Mass.:
392.572
SMILES:
[H][C@@]1(CC[C@@]2([H])[C@]3([H])[C@H](O)C[C@]4([H])C[C@H](O)CC[C@]4(C)[C@@]3([H])CC[C@]12C)[C@H](C)CCC(O)=O
: