Target
Carbonic anhydrase 7
Ligand
BDBM50066134
Substrate
Meas. Tech.
ChEMBL_1465101 (CHEMBL3405433)
Ki
10±n/a nM
Citation
 Carta, FDi Cesare Mannelli, LPinard, MGhelardini, CScozzafava, AMcKenna, RSupuran, CT A class of sulfonamide carbonic anhydrase inhibitors with neuropathic pain modulating effects. Bioorg Med Chem 23:1828-40 (2015)  
Target
Name:
Carbonic anhydrase 7
Synonyms:
CA-VII CAH7_HUMAN Carbonic anhydrase Carbonic anhydrase VII (CA VII)
Type:
Enzyme
Mol. Mass.:
29664.11
Organism:
Homo sapiens (Human)
Description:
Human cloned isozyme.
Residue:
264
  
Inhibitor
Name:
BDBM50066134
Synonyms:
CHEMBL3402959
Type:
Small organic molecule
Emp. Form.:
C9H13NO3S
Mol. Mass.:
215.269
SMILES:
CCCOc1ccc(cc1)S(N)(=O)=O
: