Target
Bifunctional epoxide hydrolase 2
Ligand
BDBM50066845
Substrate
Meas. Tech.
ChEMBL_1465994 (CHEMBL3406976)
IC50
2.3±n/a nM
Citation
 Takai, KChiyo, NNakajima, TNariai, TIshikawa, CNakatani, SIkeno, AYamamoto, SSone, T Three-dimensional rational approach to the discovery of potent substituted cyclopropyl urea soluble epoxide hydrolase inhibitors. Bioorg Med Chem Lett 25:1705-8 (2015)  
Target
Name:
Bifunctional epoxide hydrolase 2
Synonyms:
Cytosolic epoxide hydrolase 2 EPHX2 HYES_HUMAN Soluble epoxide hydrolase (sEH) | epoxide hydrolase 2, cytoplasmic
Type:
Enzyme
Mol. Mass.:
62613.07
Organism:
Homo sapiens (Human)
Description:
P34913
Residue:
555
  
Inhibitor
Name:
BDBM50066845
Synonyms:
CHEMBL3401634
Type:
Small organic molecule
Emp. Form.:
C30H32N2O4
Mol. Mass.:
484.5861
SMILES:
OC(=O)CCc1ccc(OC2CCN(CC2)C(=O)N[C@H]2[C@@H]([C@@H]2c2ccccc2)c2ccccc2)cc1
: