Target
Coagulation factor VII
Ligand
BDBM13558
Substrate
Meas. Tech.
ChEMBL_1466589 (CHEMBL3407182)
Ki
190±n/a nM
Citation
 Glunz, PWCheng, XCheney, DLWeigelt, CAWei, ALuettgen, JMWong, PCWexler, RRPriestley, ES Design and synthesis of potent, selective phenylimidazole-based FVIIa inhibitors. Bioorg Med Chem Lett 25:2169-73 (2015)  
Target
Name:
Coagulation factor VII
Synonyms:
Eptacog alfa FA7_HUMAN Factor VIIa (fVIIa) SPCA serum prothrombin conversion accelerator
Type:
Enzyme
Mol. Mass.:
51599.89
Organism:
Homo sapiens (Human)
Description:
Residue:
466
  
Inhibitor
Name:
BDBM13558
Synonyms:
2-[(4-carbamimidoylphenyl)amino]-2-(3,5-diethoxyphenyl)acetic acid phenylglycine derivative 1
Type:
Small organic molecule
Emp. Form.:
C19H23N3O4
Mol. Mass.:
357.4036
SMILES:
CCOc1cc(OCC)cc(c1)C(Nc1ccc(cc1)C(N)=N)C(O)=O
: