Target
Suppressor of tumorigenicity 14 protein
Ligand
BDBM50069106
Substrate
Meas. Tech.
ChEMBL_1466698 (CHEMBL3404296)
Ki
620±n/a nM
Citation
 Franco, FMJones, DEHarris, PKHan, ZWildman, SAJarvis, CMJanetka, JW Structure-based discovery of small molecule hepsin and HGFA protease inhibitors: Evaluation of potency and selectivity derived from distinct binding pockets. Bioorg Med Chem 23:2328-43 (2015)  
Target
Name:
Suppressor of tumorigenicity 14 protein
Synonyms:
Epithin MT-SP1 PRSS14 SNC19 ST14_HUMAN Suppressor of tumorigenicity 14 protein TADG15
Type:
Single-pass type II membrane protein
Mol. Mass.:
94769.23
Organism:
Homo sapiens (Human)
Description:
Q9Y5Y6
Residue:
855
  
Inhibitor
Name:
BDBM50069106
Synonyms:
CHEMBL3402439
Type:
Small organic molecule
Emp. Form.:
C29H33N5O5S
Mol. Mass.:
563.668
SMILES:
Cc1ccc(cc1)S(=O)(=O)N[C@@H](Cc1cccc(c1)C(N)=N)C(=O)N1CCN(CC1)C(=O)OCc1ccccc1
: