Target
Hepatocyte growth factor activator
Ligand
BDBM50069107
Substrate
Meas. Tech.
ChEMBL_1466697 (CHEMBL3404295)
Ki
18200±n/a nM
Citation
 Franco, FMJones, DEHarris, PKHan, ZWildman, SAJarvis, CMJanetka, JW Structure-based discovery of small molecule hepsin and HGFA protease inhibitors: Evaluation of potency and selectivity derived from distinct binding pockets. Bioorg Med Chem 23:2328-43 (2015)  
Target
Name:
Hepatocyte growth factor activator
Synonyms:
HGF activator HGFAC Hepatocyte growth factor activator Hepatocyte growth factor activator short chain
Type:
PROTEIN
Mol. Mass.:
70690.18
Organism:
Homo sapiens (Human)
Description:
ChEMBL_109514
Residue:
655
  
Inhibitor
Name:
BDBM50069107
Synonyms:
CHEMBL356792
Type:
Small organic molecule
Emp. Form.:
C30H31N5O3S
Mol. Mass.:
541.664
SMILES:
[H][C@@](Cc1cccc(c1)C(N)=N)(NS(=O)(=O)c1ccc2ccccc2c1)C(=O)N1CCN(CC1)c1ccccc1
: