Target
Acetyl-CoA carboxylase 2
Ligand
BDBM50069760
Substrate
Meas. Tech.
ChEMBL_1469473 (CHEMBL3412131)
IC50
60±n/a nM
Citation
 Bourbeau, MPBartberger, MD Recent advances in the development of acetyl-CoA carboxylase (ACC) inhibitors for the treatment of metabolic disease. J Med Chem 58:525-36 (2015)  
Target
Name:
Acetyl-CoA carboxylase 2
Synonyms:
ACACB ACC-beta ACCB Acetyl-CoA carboxylase 2 Acetyl-CoA carboxylase 2 (ACC2)
Type:
Protein
Mol. Mass.:
276535.21
Organism:
Homo sapiens (Human)
Description:
O00763
Residue:
2458
  
Inhibitor
Name:
BDBM50069760
Synonyms:
CHEMBL3407541
Type:
Small organic molecule
Emp. Form.:
C25H33FN2O2
Mol. Mass.:
412.5401
SMILES:
CCCOc1ccc(C2CCN(CC2)c2ccc(cc2F)C(C)NC(C)=O)c(C)c1
: