Target
Cytochrome P450 2C19
Ligand
BDBM50069982
Substrate
Meas. Tech.
ChEMBL_1469956 (CHEMBL3414383)
IC50
>10000±n/a nM
Citation
 Tosh, DKFinley, APaoletta, SMoss, SMGao, ZGGizewski, ETAuchampach, JASalvemini, DJacobson, KA In vivo phenotypic screening for treating chronic neuropathic pain: modification of C2-arylethynyl group of conformationally constrained A3 adenosine receptor agonists. J Med Chem 57:9901-14 (2014)  
Target
Name:
Cytochrome P450 2C19
Synonyms:
CP2CJ_HUMAN CYPIIC17 Cytochrome P450 2C19 (CYP2C19) Mephenytoin 4-hydroxylase P450-254C
Type:
Enzyme
Mol. Mass.:
55935.47
Organism:
Homo sapiens (Human)
Description:
P33261
Residue:
490
  
Inhibitor
Name:
BDBM50069982
Synonyms:
CHEMBL3407778
Type:
Small organic molecule
Emp. Form.:
C20H20N6O4
Mol. Mass.:
408.4106
SMILES:
[H][C@]12C[C@]1([C@@H](O)[C@@H](O)[C@@H]2n1cnc2c(NC)nc(nc12)C#Cc1ccco1)C(=O)NC
: