Target
NAD-dependent protein deacetylase sirtuin-2
Ligand
BDBM50070588
Substrate
Meas. Tech.
ChEMBL_1468119 (CHEMBL3414005)
Ki
3700±n/a nM
Citation
 Yang, TChen, XJin, HXSethi, GGo, ML Functionalized tetrahydro-1H-pyrido[4,3-b]indoles: a novel chemotype with Sirtuin 2 inhibitory activity. Eur J Med Chem 92:145-55 (2015)  
Target
Name:
NAD-dependent protein deacetylase sirtuin-2
Synonyms:
NAD-Dependent Deacetylase Sirtuin-2 NAD-dependent deacetylase sirtuin 3 SIR2-like SIR2L SIR2_HUMAN Sirtuin 2 (SIRT2)
Type:
Hydrolase
Mol. Mass.:
43172.62
Organism:
Homo sapiens (Human)
Description:
Residue:
389
  
Inhibitor
Name:
BDBM50070588
Synonyms:
CHEMBL3408821
Type:
Small organic molecule
Emp. Form.:
C26H34N2O2S
Mol. Mass.:
438.625
SMILES:
CCCCCCCCn1c2CCNCc2c2cc(ccc12)-c1ccc(cc1)S(C)(=O)=O
: