Target
Carbonic anhydrase 2
Ligand
BDBM50071817
Substrate
Meas. Tech.
ChEMBL_1467068 (CHEMBL3411265)
Ki
201±n/a nM
Citation
 Tanpure, RPRen, BPeat, TSBornaghi, LFVullo, DSupuran, CTPoulsen, SA Carbonic anhydrase inhibitors with dual-tail moieties to match the hydrophobic and hydrophilic halves of the carbonic anhydrase active site. J Med Chem 58:1494-501 (2015)  
Target
Name:
Carbonic anhydrase 2
Synonyms:
CA-II CAC Carbonate dehydratase II Carbonic anhydrase 2 (CA-II) Carbonic anhydrase C Carbonic anhydrase II (CA-II) Carbonic anhydrase II (hCA II) | Carbonic anhydrase isoenzyme II (hCA II)
Type:
Enzyme
Mol. Mass.:
29250.71
Organism:
Homo sapiens (Human)
Description:
P00918
Residue:
260
  
Inhibitor
Name:
BDBM50071817
Synonyms:
CHEMBL3410761
Type:
Small organic molecule
Emp. Form.:
C8H8N4O2S2
Mol. Mass.:
256.305
SMILES:
NS(=O)(=O)c1nnc(s1)N(CC#C)CC#C
: