Target
Histone-lysine N-methyltransferase SUV39H1
Ligand
BDBM50396981
Substrate
Meas. Tech.
ChEMBL_1473655 (CHEMBL3421224)
Ki
>20000±n/a nM
Citation
 Kaniskan, HÜKonze, KDJin, J Selective inhibitors of protein methyltransferases. J Med Chem 58:1596-629 (2015)  
Target
Name:
Histone-lysine N-methyltransferase SUV39H1
Synonyms:
H3-K9-HMTase 1 KMT1A Position-effect variegation 3-9 homolog SUV39H1 Su(var)3-9 homolog 1 | Suppressor of variegation 3-9 homolog 1
Type:
PROTEIN
Mol. Mass.:
47917.07
Organism:
Homo sapiens (Human)
Description:
ChEMBL_1473655
Residue:
412
  
Inhibitor
Name:
BDBM50396981
Synonyms:
CHEMBL2171174
Type:
Small organic molecule
Emp. Form.:
C15H22N6O5S
Mol. Mass.:
398.437
SMILES:
CNc1ncnc2n(cnc12)[C@@H]1O[C@H](CSCC[C@H](N)C(O)=O)[C@@H](O)[C@H]1O
: