Target
Steroid 17-alpha-hydroxylase/17,20 lyase
Ligand
BDBM50075389
Substrate
Meas. Tech.
ChEMBL_1473765 (CHEMBL3418490)
Ki
1.4±n/a nM
Citation
 Njar, VCBrodie, AM Discovery and development of Galeterone (TOK-001 or VN/124-1) for the treatment of all stages of prostate cancer. J Med Chem 58:2077-87 (2015)  
Target
Name:
Steroid 17-alpha-hydroxylase/17,20 lyase
Synonyms:
CP17A_HUMAN CYP17A1 Cytochrome P450 17A1 Cytochrome P450 C17 (CYP17) Cytochrome P450-C17 P450-C17 Steroid 17-alpha-Monooxygenase (CYP17) Steroid 17-alpha-monooxygenase | cytochrome P450 monooxygenase 17 alpha hydroxylase/17,20-lyase (CYP17)
Type:
Enzyme
Mol. Mass.:
57382.42
Organism:
Homo sapiens (Human)
Description:
E.coli expressing human CYP17
Residue:
508
  
Inhibitor
Name:
BDBM50075389
Synonyms:
CHEMBL3415119
Type:
Small organic molecule
Emp. Form.:
C21H29N3O
Mol. Mass.:
339.4745
SMILES:
[H][C@@]12CC=C(n3ccnn3)[C@@]1(C)CC[C@@]1([H])[C@@]2([H])CC=C2C[C@@H](O)CC[C@]12C
: