Target
Aldehyde dehydrogenase family 1 member A3
Ligand
BDBM50076544
Substrate
Meas. Tech.
ChEMBL_1473079 (CHEMBL3421189)
IC50
>100000±n/a nM
Citation
 Morgan, CAHurley, TD Characterization of two distinct structural classes of selective aldehyde dehydrogenase 1A1 inhibitors. J Med Chem 58:1964-75 (2015)  
Target
Name:
Aldehyde dehydrogenase family 1 member A3
Synonyms:
AL1A3_HUMAN ALDH6 Aldehyde dehydrogenase family 1 member A3 RalDH3 | Retinaldehyde dehydrogenase 3
Type:
PROTEIN
Mol. Mass.:
56110.85
Organism:
Homo sapiens (Human)
Description:
ChEMBL_109700
Residue:
512
  
Inhibitor
Name:
BDBM50076544
Synonyms:
CHEMBL3416553
Type:
Small organic molecule
Emp. Form.:
C23H32N6O3
Mol. Mass.:
440.5386
SMILES:
CCCCn1c(CN2CCN(CC2)c2ccc(OC)cc2)nc2n(C)c(=O)n(C)c(=O)c12
: