Target
KiSS-1 receptor
Ligand
BDBM50082079
Substrate
Meas. Tech.
ChEMBL_1474616 (CHEMBL3423932)
EC50
0.900000±n/a nM
Citation
 Beltramo, MRobert, VGalibert, MMadinier, JBMarceau, PDardente, HDecourt, CDe Roux, NLomet, DDelmas, AFCaraty, AAucagne, V Rational design of triazololipopeptides analogs of kisspeptin inducing a long-lasting increase of gonadotropins. J Med Chem 58:3459-70 (2015)  
Target
Name:
KiSS-1 receptor
Synonyms:
AXOR12 G-protein coupled receptor 54 (GPR54) Hypogonadotropin-1 KISSR_HUMAN Kisspeptins receptor hOT7T175
Type:
G Protein-Coupled Receptor (GPCR)
Mol. Mass.:
42613.79
Organism:
Homo sapiens (Human)
Description:
Binding assay was performed using membranes from the CHO cell transfectants.
Residue:
398
  
Inhibitor
Name:
BDBM50082079
Synonyms:
CHEMBL3422412
Type:
Small organic molecule
Emp. Form.:
C64H90N18O16
Mol. Mass.:
1367.5104
SMILES:
CC(C)C[C@H](NC(=O)CNC(=O)[C@H](Cc1ccccc1)NC(=O)[C@H](CO)NC(=O)[C@H](CC(N)=O)NC(=O)[C@H](Cc1c[nH]c2ccccc12)NC(=O)[C@H](CC(N)=O)NC(=O)[C@H](CCCCNC(C)=O)NC(C)=O)C(=O)N[C@@H](CCCNC(N)=N)C(=O)N[C@@H](Cc1ccc(O)cc1)C(N)=O
: