Target
Adenosine receptor A1
Ligand
BDBM50083551
Substrate
Meas. Tech.
ChEMBL_1474461 (CHEMBL3423750)
Kd
>100000±n/a nM
Citation
 Molero, AVendrell, MBonaventura, JZachmann, JLópez, LPardo, LLluis, CCortés, AAlbericio, FCasadó, VRoyo, M A solid-phase combinatorial approach for indoloquinolizidine-peptides with high affinity at D(1) and D(2) dopamine receptors. Eur J Med Chem 97:173-80 (2015)  
Target
Name:
Adenosine receptor A1
Synonyms:
A1 adenosine receptor (hA1) AA1R_HUMAN ADORA1 Adenosine A1-receptor Adenosine receptor A1 (hA1) | Adenosine transporter (AdT)
Type:
G Protein-Coupled Receptor (GPCR)
Mol. Mass.:
36520.92
Organism:
Homo sapiens (Human)
Description:
P30542
Residue:
326
  
Inhibitor
Name:
BDBM50083551
Synonyms:
CHEMBL3423406
Type:
Small organic molecule
Emp. Form.:
C39H52N8O4
Mol. Mass.:
696.8814
SMILES:
[H][C@]12CC[C@@H](CN1CCc1c2[nH]c2ccccc12)C(=O)N[C@@H](CCCC)C(=O)N[C@@H](Cc1c[nH]c2ccccc12)C(=O)N[C@@H](CCCCN)C(N)=O
: