Target
Patatin-like phospholipase domain-containing protein 2
Ligand
BDBM50084672
Substrate
Meas. Tech.
ChEMBL_1476694 (CHEMBL3428915)
IC50
75000±n/a nM
Citation
 Mayer, NSchweiger, MMelcher, MCFledelius, CZechner, RZimmermann, RBreinbauer, R Structure-activity studies in the development of a hydrazone based inhibitor of adipose-triglyceride lipase (ATGL). Bioorg Med Chem 23:2904-16 (2015)  
Target
Name:
Patatin-like phospholipase domain-containing protein 2
Synonyms:
Adipose triglyceride lipase Desnutrin Patatin-like phospholipase domain-containing protein 2 | Pnpla2
Type:
PROTEIN
Mol. Mass.:
53655.79
Organism:
Mus musculus
Description:
ChEMBL_109612
Residue:
486
  
Inhibitor
Name:
BDBM50084672
Synonyms:
CHEMBL3427323
Type:
Small organic molecule
Emp. Form.:
C17H19N3O
Mol. Mass.:
281.3523
SMILES:
Oc1ccccc1\C=N\N1CCN(CC1)c1ccccc1
: