Target
ADP-ribosyl cyclase/cyclic ADP-ribose hydrolase 1
Ligand
BDBM50086407
Substrate
Meas. Tech.
ChEMBL_1476003 (CHEMBL3428359)
IC50
2690±n/a nM
Citation
 Haffner, CDBecherer, JDBoros, EECadilla, RCarpenter, TCowan, DDeaton, DNGuo, YHarrington, WHenke, BRJeune, MRKaldor, IMilliken, NPetrov, KGPreugschat, FSchulte, CShearer, BGShearer, TSmalley, TLStewart, ELStuart, JDUlrich, JC Discovery, Synthesis, and Biological Evaluation of Thiazoloquin(az)olin(on)es as Potent CD38 Inhibitors. J Med Chem 58:3548-71 (2015)  
Target
Name:
ADP-ribosyl cyclase/cyclic ADP-ribose hydrolase 1
Synonyms:
CD38 Lymphocyte differentiation antigen CD38
Type:
PROTEIN
Mol. Mass.:
34333.62
Organism:
Homo sapiens (Human)
Description:
ChEMBL_1509931
Residue:
300
  
Inhibitor
Name:
BDBM50086407
Synonyms:
CHEMBL3426083
Type:
Small organic molecule
Emp. Form.:
C18H14N4O2S2
Mol. Mass.:
382.459
SMILES:
CS(=O)(=O)c1cccc(Nc2ncnc3ccc(cc23)-c2cncs2)c1
: