Target
Tyrosine-protein kinase Lck
Ligand
BDBM50022932
Substrate
Meas. Tech.
ChEMBL_1477116 (CHEMBL3428283)
Ki
340±n/a nM
Citation
 Burch, JDBarrett, KChen, YDeVoss, JEigenbrot, CGoldsmith, RIsmaili, MHLau, KLin, ZOrtwine, DFZarrin, AAMcEwan, PABarker, JJEllebrandt, CKordt, DStein, DBWang, XChen, YHu, BXu, XYuen, PWZhang, YPei, Z Tetrahydroindazoles as Interleukin-2 Inducible T-Cell Kinase Inhibitors. Part II. Second-Generation Analogues with Enhanced Potency, Selectivity, and Pharmacodynamic Modulation in Vivo. J Med Chem 58:3806-16 (2015)  
Target
Name:
Tyrosine-protein kinase Lck
Synonyms:
2.7.10.2 LCK_HUMAN Leukocyte C-terminal Src kinase Lymphocyte-specific protein tyrosine kinase Protein YT16 Proto-oncogene tyrosine-protein kinase LCK T cell-specific protein-tyrosine kinase
Type:
Mol. Mass.:
57987.83
Organism:
Homo sapiens (Human)
Description:
P06239
Residue:
509
  
Inhibitor
Name:
BDBM50022932
Synonyms:
CHEMBL3298371
Type:
Small organic molecule
Emp. Form.:
C24H32N6O
Mol. Mass.:
420.5505
SMILES:
CN(C)CC[C@@H](c1ccccc1)n1cc(NC(=O)c2n[nH]c3CC(C)(C)CCc23)cn1
: